请稍等 ...
×

采纳答案成功!

向帮助你的同学说点啥吧!感谢那些助人为乐的人

mybatis-generator 生成失败

回答1 浏览1073 2017-09-01 17:59:15

"C:\Program Files\Java\jdk1.8.0_131\bin\java" -Dmaven.home=C:\apache-maven-3.0.5 -Dclassworlds.conf=C:\apache-maven-3.0.5\bin\m2.conf -Didea.launcher.port=7534 "-Didea.launcher.bin.path=C:\Program Files (x86)\JetBrains\IntelliJ IDEA 15.0.6\bin" -Dfile.encoding=UTF-8 -classpath "C:\apache-maven-3.0.5\boot\plexus-classworlds-2.4.jar;C:\Program Files (x86)\JetBrains\IntelliJ IDEA 15.0.6\lib\idea_rt.jar" com.intellij.rt.execution.application.AppMain org.codehaus.classworlds.Launcher -Didea.version=15.0.6 org.mybatis.generator:mybatis-generator-maven-plugin:1.3.2:generate

[INFO] Scanning for projects...

[WARNING] 

[WARNING] Some problems were encountered while building the effective model for com:mmall:war:1.0-SNAPSHOT

[WARNING] 'build.plugins.plugin.version' for org.apache.maven.plugins:maven-compiler-plugin is missing. @ line 264, column 15

[WARNING] 

[WARNING] It is highly recommended to fix these problems because they threaten the stability of your build.

[WARNING] 

[WARNING] For this reason, future Maven versions might no longer support building such malformed projects.

[WARNING] 

[INFO]                                                                         

[INFO] ------------------------------------------------------------------------

[INFO] Building mmall Maven Webapp 1.0-SNAPSHOT

[INFO] ------------------------------------------------------------------------

[INFO] 

[INFO] --- mybatis-generator-maven-plugin:1.3.2:generate (default-cli) @ mmall ---

[INFO] ------------------------------------------------------------------------

[INFO] BUILD FAILURE

[INFO] ------------------------------------------------------------------------

[INFO] Total time: 0.472s

[INFO] Finished at: Fri Sep 01 17:50:58 GMT+08:00 2017

[INFO] Final Memory: 5M/123M

[INFO] ------------------------------------------------------------------------

[ERROR] Failed to execute goal org.mybatis.generator:mybatis-generator-maven-plugin:1.3.2:generate (default-cli) on project mmall: Execution default-cli of goal org.mybatis.generator:mybatis-generator-maven-plugin:1.3.2:generate failed: Plugin org.mybatis.generator:mybatis-generator-maven-plugin:1.3.2 or one of its dependencies could not be resolved: Failure to find org.codehaus.plexus:plexus-interpolation:jar:1.1 in http://repo.maven.apache.org/maven2 was cached in the local repository, resolution will not be reattempted until the update interval of central has elapsed or updates are forced -> [Help 1]

[ERROR] 

[ERROR] To see the full stack trace of the errors, re-run Maven with the -e switch.

[ERROR] Re-run Maven using the -X switch to enable full debug logging.

[ERROR] 

[ERROR] For more information about the errors and possible solutions, please read the following articles:

[ERROR] [Help 1] http://cwiki.apache.org/confluence/display/MAVEN/PluginResolutionException


Process finished with exit code 1


该问题答案只有购买此课程才可进行查看~

从0开始 独立完成企业级Java电商网站服务端开发(长期维护)

难度中级
时长20小时
人数8705
好评度99.4%

【毕设】前后端分离,数据库接口设计,架构设计,功能开发,上线运维

讲师

Geely JAVA开发工程师

Geely,丰富的互联网项目经验,公司内部技术讲师,热爱技术,乐于分享;教学格言:把复杂的技术简单化,简单的技术极致化

意见反馈 帮助中心 APP下载
官方微信